Shelve off temporary changes to a separate branch

2 jobs for better-validation in 49 seconds (queued for 1 second)
latest
Status Name Job ID Coverage
  Build Pkgsrc
passed build_pkgsrc:buster #16613

00:00:20

 
  Build Pkg
failed build_pkg:buster:amd64 #16614
amd64

00:00:28

 
Name Stage Failure
failed
build_pkg:buster:amd64 Build Pkg
dh_auto_build: cd obj-x86_64-linux-gnu && go install -gcflags=all=\"-trimpath=/tmp/tmp.wBTvgp1J0S/build/obj-x86_64-linux-gnu/src\" -asmflags=all=\"-trimpath=/tmp/tmp.wBTvgp1J0S/build/obj-x86_64-linux-gnu/src\" -v -p 8 git.autistici.org/ai3/accountserver git.autistici.org/ai3/accountserver/backend/cache git.autistici.org/ai3/accountserver/backend/ldap git.autistici.org/ai3/accountserver/backend/webappdb git.autistici.org/ai3/accountserver/cmd/accountserver git.autistici.org/ai3/accountserver/integrationtest git.autistici.org/ai3/accountserver/ldaptest git.autistici.org/ai3/accountserver/server returned exit code 2
make: *** [debian/rules:12: build] Error 2
dpkg-buildpackage: error: debian/rules build subprocess returned exit status 2
debuild: fatal error at line 1182:
dpkg-buildpackage -us -uc -ui -b failed
ERROR: debuild failed!
Running after_script
Uploading artifacts for failed job
ERROR: Job failed: exit code 1