Merge branch 'search' into 'master'

Search

Closes #6

See merge request !4
3 jobs for master in 1 minute and 17 seconds (queued for 2 seconds)
Status Job ID Name Coverage
  Build Src
passed #6150
build:src

00:00:18

 
  Build Pkg
failed #6151
build:pkg

00:00:58

 
  Upload
skipped #6152
upload:pkg
 
Name Stage Failure
failed
build:pkg Build Pkg
?   	git.autistici.org/ai3/accountserver/server	[no test files]
dh_auto_test: go test -v -p 2 git.autistici.org/ai3/accountserver git.autistici.org/ai3/accountserver/backend git.autistici.org/ai3/accountserver/cmd/accountserver git.autistici.org/ai3/accountserver/ldaptest git.autistici.org/ai3/accountserver/server returned exit code 2
debian/rules:12: recipe for target 'build' failed
make: *** [build] Error 2
dpkg-buildpackage: error: debian/rules build gave error exit status 2
debuild: fatal error at line 1116:
dpkg-buildpackage -rfakeroot -us -uc -b failed
ERROR: debuild failed!
ERROR: Job failed: exit code 1