Build a Debian package

4 jobs from master in 2 minutes and 15 seconds
latest
Status Job ID Name Coverage
  Build Pkgsrc
passed #5940
build_pkgsrc:stretch

00:00:14

 
  Build Pkg
failed #5941
amd64
build_pkg:stretch:amd64

00:00:28

failed #5942
arm64
build_pkg:stretch:arm64

00:02:00

 
  Upload Pkg
skipped #5943
upload_pkg
 
Name Stage Failure
failed
build_pkg:stretch:arm64 Build Pkg
src/git.autistici.org/ai3/float-debug-proxy/vendor/github.com/miekg/dns/msg_helpers.go:144: undefined: base32.NoPadding
dh_auto_build: go install -v -p 4 git.autistici.org/ai3/float-debug-proxy returned exit code 2
debian/rules:11: recipe for target 'build' failed
make: *** [build] Error 2
dpkg-buildpackage: error: debian/rules build gave error exit status 2
debuild: fatal error at line 1116:
dpkg-buildpackage -rfakeroot -us -uc -b failed
ERROR: debuild failed!
ERROR: Job failed: exit code 1
failed
build_pkg:stretch:amd64 Build Pkg
src/git.autistici.org/ai3/float-debug-proxy/vendor/github.com/miekg/dns/msg_helpers.go:144: undefined: base32.NoPadding
dh_auto_build: go install -v -p 2 git.autistici.org/ai3/float-debug-proxy returned exit code 2
debian/rules:11: recipe for target 'build' failed
make: *** [build] Error 2
dpkg-buildpackage: error: debian/rules build gave error exit status 2
debuild: fatal error at line 1116:
dpkg-buildpackage -rfakeroot -us -uc -b failed
ERROR: debuild failed!
ERROR: Job failed: exit code 1