Update CI to buster

3 jobs for master in 49 seconds (queued for 3 seconds)
Status Name Job ID Coverage
  Build Pkgsrc
passed build_pkgsrc:buster #38469

00:00:28

 
  Build Pkg
failed build_pkg:buster:amd64 #38470
amd64

00:00:21

 
  Upload Pkg
skipped upload_pkg #38471
 
Name Stage Failure
failed
build_pkg:buster:amd64 Build Pkg
dh_installman
dh_systemd_enable
dh_systemd_enable: dh_systemd_enable is no longer used in compat >= 11, please use dh_installsystemd instead
make: *** [debian/rules:99: binary-arch] Error 25
dpkg-buildpackage: error: debian/rules binary subprocess returned exit status 2
debuild: fatal error at line 1182:
dpkg-buildpackage -us -uc -ui -b failed
ERROR: debuild failed!
Cleaning up file based variables
ERROR: Job failed: exit code 1