Upgrade to Buster

3 jobs for latest in 2 minutes and 57 seconds
Status Name Job ID Coverage
  Build Pkgsrc
passed build_pkgsrc:buster #17414

00:00:35

 
  Build Pkg
failed build_pkg:buster:amd64 #17415
amd64

00:00:25

failed build_pkg:buster:arm64 #17416
arm64

00:02:21

 
Name Stage Failure
failed
build_pkg:buster:arm64 Build Pkg
dh_systemd_enable: dh_systemd_enable is no longer used in compat >= 11, please use dh_installsystemd instead
make: *** [debian/rules:99: binary-arch] Error 25
dpkg-buildpackage: error: debian/rules binary subprocess returned exit status 2
debuild: fatal error at line 1182:
dpkg-buildpackage -us -uc -ui -b failed
ERROR: debuild failed!
Running after_script
Uploading artifacts for failed job
ERROR: Job failed: exit code 1
failed
build_pkg:buster:amd64 Build Pkg
dh_systemd_enable: dh_systemd_enable is no longer used in compat >= 11, please use dh_installsystemd instead
make: *** [debian/rules:99: binary-arch] Error 25
dpkg-buildpackage: error: debian/rules binary subprocess returned exit status 2
debuild: fatal error at line 1182:
dpkg-buildpackage -us -uc -ui -b failed
ERROR: debuild failed!
Running after_script
Uploading artifacts for failed job
ERROR: Job failed: exit code 1