Reset CI config to default

5 jobs for master in 49 seconds (queued for 4 seconds)
latest
Status Name Job ID Coverage
  Build
passed build_pkg:bullseye:amd64 #41135
amd64

00:00:33

failed build_pkg:buster:amd64 #41134
amd64

00:00:27

passed pkg_src #41133

00:00:04

 
  Release
passed upload_pkg:bullseye #41137

00:00:11

skipped upload_pkg:buster #41136
 
Name Stage Failure
failed
build_pkg:buster:amd64 Build
   dh_dwz -O--buildsystem=golang
dh_dwz: dwz -q -- debian/logcat/usr/bin/logcat returned exit code 1
make: *** [debian/rules:6: binary] Error 1
dpkg-buildpackage: error: debian/rules binary subprocess returned exit status 2
debuild: fatal error at line 1182:
dpkg-buildpackage -us -uc -ui -b failed
ERROR: debuild failed!
Cleaning up project directory and file based variables
ERROR: Job failed: exit code 1