Update dependencies

3 jobs for master in 36 seconds
Status Job ID Name Coverage
  Build Src
passed #5697
build:src

00:00:17

 
  Build Pkg
failed #5698
build:pkg

00:00:19

 
  Upload
skipped #5699
upload:pkg
 
Name Stage Failure
failed
build:pkg Build Pkg
	/tmp/tmp.y5aKrspfxi/build/obj-x86_64-linux-gnu/src/github.com/prometheus/procfs/nfs (from $GOPATH)
dh_auto_build: go install -v -p 2 git.autistici.org/ale/tabacco git.autistici.org/ale/tabacco/cmd/tabacco git.autistici.org/ale/tabacco/jobs git.autistici.org/ale/tabacco/metadb git.autistici.org/ale/tabacco/metadb/client git.autistici.org/ale/tabacco/metadb/migrations git.autistici.org/ale/tabacco/metadb/server git.autistici.org/ale/tabacco/util returned exit code 1
debian/rules:8: recipe for target 'build' failed
make: *** [build] Error 1
dpkg-buildpackage: error: debian/rules build gave error exit status 2
debuild: fatal error at line 1116:
dpkg-buildpackage -rfakeroot -us -uc -b failed
ERROR: debuild failed!
ERROR: Job failed: exit code 1