Merge branch 'v2' into 'master'

V2

See merge request !1
3 jobs for master in 1 minute and 23 seconds (queued for 1 second)
Status Job ID Name Coverage
  Build Src
passed #9136
build:src

00:00:18

 
  Build Pkg
failed #9137
build:pkg

00:01:05

 
  Upload
skipped #9138
upload:pkg
 
Name Stage Failure
failed
build:pkg Build Pkg
?   	git.autistici.org/ai3/tools/tabacco/util	[no test files]
dh_auto_test: go test -v -p 2 git.autistici.org/ai3/tools/tabacco git.autistici.org/ai3/tools/tabacco/cmd/tabacco git.autistici.org/ai3/tools/tabacco/jobs git.autistici.org/ai3/tools/tabacco/metadb git.autistici.org/ai3/tools/tabacco/metadb/client git.autistici.org/ai3/tools/tabacco/metadb/migrations git.autistici.org/ai3/tools/tabacco/metadb/server git.autistici.org/ai3/tools/tabacco/util returned exit code 1
debian/rules:8: recipe for target 'build' failed
make: *** [build] Error 1
dpkg-buildpackage: error: debian/rules build gave error exit status 2
debuild: fatal error at line 1116:
dpkg-buildpackage -rfakeroot -us -uc -b failed
ERROR: debuild failed!
ERROR: Job failed: exit code 1