Drop redirectord binary

3 jobs for v2 in 1 minute and 38 seconds (queued for 1 second)
Status Job ID Name Coverage
  Build Pkgsrc
passed #7358
build_pkgsrc:stretch

00:00:20

 
  Build Pkg
failed #7359
amd64
build_pkg:stretch:amd64

00:00:31

failed #7360
arm64
build_pkg:stretch:arm64

00:01:16

 
Name Stage Failure
failed
build_pkg:stretch:amd64 Build Pkg
make[1]: *** [override_dh_install] Error 1
make[1]: Leaving directory '/tmp/tmp.OrSkWldWHG/build'
debian/rules:24: recipe for target 'binary' failed
make: *** [binary] Error 2
dpkg-buildpackage: error: fakeroot debian/rules binary gave error exit status 2
debuild: fatal error at line 1116:
dpkg-buildpackage -rfakeroot -us -uc -b failed
ERROR: debuild failed!
ERROR: Job failed: exit code 1
failed
build_pkg:stretch:arm64 Build Pkg
make[1]: *** [override_dh_install] Error 1
make[1]: Leaving directory '/tmp/tmp.oq8UZRqXjQ/build'
debian/rules:24: recipe for target 'binary' failed
make: *** [binary] Error 2
dpkg-buildpackage: error: fakeroot debian/rules binary gave error exit status 2
debuild: fatal error at line 1116:
dpkg-buildpackage -rfakeroot -us -uc -b failed
ERROR: debuild failed!
ERROR: Job failed: exit code 1