Display stream metadata in the status page

3 jobs for v2 in 2 minutes and 51 seconds
Status Job ID Name Coverage
  Build Pkgsrc
passed #7408
build_pkgsrc:stretch

00:00:17

 
  Build Pkg
failed #7409
amd64
build_pkg:stretch:amd64

00:01:04

failed #7410
arm64
build_pkg:stretch:arm64

00:02:33

 
Name Stage Failure
failed
build_pkg:stretch:arm64 Build Pkg
?   	git.autistici.org/ale/autoradio/util	[no test files]
dh_auto_test: go test -v -p 4 git.autistici.org/ale/autoradio git.autistici.org/ale/autoradio/client git.autistici.org/ale/autoradio/cmd/radiobench git.autistici.org/ale/autoradio/cmd/radioctl git.autistici.org/ale/autoradio/cmd/radiod git.autistici.org/ale/autoradio/cmd/transcoderd git.autistici.org/ale/autoradio/coordination/election git.autistici.org/ale/autoradio/coordination/presence git.autistici.org/ale/autoradio/coordination/watcher git.autistici.org/ale/autoradio/node git.autistici.org/ale/autoradio/node/bwmonitor git.autistici.org/ale/autoradio/node/icecast git.autistici.org/ale/autoradio/node/lbv2 git.autistici.org/ale/autoradio/proto git.autistici.org/ale/autoradio/transcoder git.autistici.org/ale/autoradio/util returned exit code 1
debian/rules:9: recipe for target 'build' failed
make: *** [build] Error 1
dpkg-buildpackage: error: debian/rules build gave error exit status 2
debuild: fatal error at line 1116:
dpkg-buildpackage -rfakeroot -us -uc -b failed
ERROR: debuild failed!
ERROR: Job failed: exit code 1
failed
build_pkg:stretch:amd64 Build Pkg
?   	git.autistici.org/ale/autoradio/util	[no test files]
dh_auto_test: go test -v -p 2 git.autistici.org/ale/autoradio git.autistici.org/ale/autoradio/client git.autistici.org/ale/autoradio/cmd/radiobench git.autistici.org/ale/autoradio/cmd/radioctl git.autistici.org/ale/autoradio/cmd/radiod git.autistici.org/ale/autoradio/cmd/transcoderd git.autistici.org/ale/autoradio/coordination/election git.autistici.org/ale/autoradio/coordination/presence git.autistici.org/ale/autoradio/coordination/watcher git.autistici.org/ale/autoradio/node git.autistici.org/ale/autoradio/node/bwmonitor git.autistici.org/ale/autoradio/node/icecast git.autistici.org/ale/autoradio/node/lbv2 git.autistici.org/ale/autoradio/proto git.autistici.org/ale/autoradio/transcoder git.autistici.org/ale/autoradio/util returned exit code 1
debian/rules:9: recipe for target 'build' failed
make: *** [build] Error 1
dpkg-buildpackage: error: debian/rules build gave error exit status 2
debuild: fatal error at line 1116:
dpkg-buildpackage -rfakeroot -us -uc -b failed
ERROR: debuild failed!
ERROR: Job failed: exit code 1