More tests; fix date parsing on /search handler

3 jobs for master in 29 seconds (queued for 2 seconds)
Status Job ID Name Coverage
  Build Src
passed #1299
build:src

00:00:12

 
  Build Pkg
failed #1300
build:pkg

00:00:16

 
  Upload
skipped #1301
upload:pkg
 
Name Stage Failure
failed
build:pkg Build Pkg There is an unknown failure, please try again
FAIL	git.autistici.org/ale/logviewer	0.003s
dh_auto_test: go test -v -p 1 git.autistici.org/ale/logviewer returned exit code 1
debian/rules:10: recipe for target 'build' failed
make: *** [build] Error 1
dpkg-buildpackage: error: debian/rules build gave error exit status 2
debuild: fatal error at line 1116:
dpkg-buildpackage -rfakeroot -us -uc -b failed
ERROR: debuild failed!
ERROR: Job failed: exit code 1