Update ai3/go-common

3 jobs for master in 1 minute and 2 seconds
Status Job ID Name Coverage
  Build Pkgsrc
passed #24284
build_pkgsrc:buster

00:00:29

 
  Build Pkg
failed #24285
amd64
build_pkg:buster:amd64

00:00:33

 
  Upload Pkg
skipped #24286
upload_pkg
 
Name Stage Failure
failed
build_pkg:buster:amd64 Build Pkg
git.autistici.org/id/keystore/backend/sql
dh_auto_build: cd obj-x86_64-linux-gnu && go install -gcflags=all=\"-trimpath=/tmp/tmp.N7LUVAhWYr/build/obj-x86_64-linux-gnu/src\" -asmflags=all=\"-trimpath=/tmp/tmp.N7LUVAhWYr/build/obj-x86_64-linux-gnu/src\" -v -p 8 git.autistici.org/id/keystore git.autistici.org/id/keystore/backend git.autistici.org/id/keystore/backend/ldap git.autistici.org/id/keystore/backend/sql git.autistici.org/id/keystore/client git.autistici.org/id/keystore/cmd/dovecot-keylookupd git.autistici.org/id/keystore/cmd/keystored git.autistici.org/id/keystore/dovecot git.autistici.org/id/keystore/server returned exit code 2
make: *** [debian/rules:8: build] Error 2
dpkg-buildpackage: error: debian/rules build subprocess returned exit status 2
debuild: fatal error at line 1182:
dpkg-buildpackage -us -uc -ui -b failed
ERROR: debuild failed!
Cleaning up file based variables
ERROR: Job failed: exit code 1