Update vendored deps

3 jobs for master in 38 seconds (queued for 2 seconds)
Status Job ID Name Coverage
  Build Src
passed #3643
build:src

00:00:13

 
  Build Pkg
failed #3644
build:pkg

00:00:24

 
  Upload
skipped #3645
upload:pkg
 
Name Stage Failure
failed
build:pkg Build Pkg There is an unknown failure, please try again
git.autistici.org/id/keystore/vendor/git.autistici.org/ai3/go-common/serverutil
dh_auto_build: go install -v -p 2 git.autistici.org/id/keystore git.autistici.org/id/keystore/backend git.autistici.org/id/keystore/client git.autistici.org/id/keystore/cmd/dovecot-keylookupd git.autistici.org/id/keystore/cmd/keystored git.autistici.org/id/keystore/dovecot git.autistici.org/id/keystore/server returned exit code 2
debian/rules:8: recipe for target 'build' failed
make: *** [build] Error 2
dpkg-buildpackage: error: debian/rules build gave error exit status 2
debuild: fatal error at line 1116:
dpkg-buildpackage -rfakeroot -us -uc -b failed
ERROR: debuild failed!
ERROR: Job failed: exit code 1