Add missing ${misc:Built-Using} to Built-Using on iprep.

Changes-By: lintian-brush
Fixes: lintian: missing-built-using-field-for-golang-package
See-also: https://lintian.debian.org/tags/missing-built-using-field-for-golang-package.html
4 jobs for lintian-fixes in 18 seconds (queued for 4 seconds)
Status Name Job ID Coverage
  Test
failed test #38003

00:00:18

 
  Build Pkgsrc
skipped build_pkgsrc:bullseye #38004
 
  Build Pkg
skipped build #38005
skipped build_pkg:bullseye:amd64 #38006
amd64
 
Name Stage Failure
failed
test Test There has been a runner system failure, please try again
ERROR: Preparation failed: failed to pull image "git.autistici.org:443/svp-bot/dependency_proxy/containers/golang:1.16" with specified policies [always]: Error response from daemon: error unmarshalling content: invalid character '<' looking for beginning of value (manager.go:205:0s)
Will be retried in 3s ...
Using Docker executor with image git.autistici.org:443/svp-bot/dependency_proxy/containers/golang:1.16 ...
Authenticating with credentials from job payload (GitLab Registry)
Pulling docker image git.autistici.org:443/svp-bot/dependency_proxy/containers/golang:1.16 ...
WARNING: Failed to pull image with policy "always": Error response from daemon: error unmarshalling content: invalid character '<' looking for beginning of value (manager.go:205:0s)
ERROR: Preparation failed: failed to pull image "git.autistici.org:443/svp-bot/dependency_proxy/containers/golang:1.16" with specified policies [always]: Error response from daemon: error unmarshalling content: invalid character '<' looking for beginning of value (manager.go:205:0s)
Will be retried in 3s ...
ERROR: Job failed (system failure): failed to pull image "git.autistici.org:443/svp-bot/dependency_proxy/containers/golang:1.16" with specified policies [always]: Error response from daemon: error unmarshalling content: invalid character '<' looking for beginning of value (manager.go:205:0s)