Add tests for the /exchange HTTP endpoint

3 jobs for fix-login-rebase in 1 minute and 26 seconds (queued for 3 seconds)
latest
Status Name Job ID Coverage
  Build Pkgsrc
passed build_pkgsrc:stretch #14089

00:00:25

 
  Build Pkg
failed build_pkg:stretch:amd64 #14090
amd64

00:00:18

failed build_pkg:stretch:arm64 #14091
arm64

00:00:59

 
Name Stage Failure
failed
build_pkg:stretch:arm64 Build Pkg
	/tmp/tmp.rO789Ln57K/build/obj-aarch64-linux-gnu/src/git.autistici.org/id/go-sso/server/httputil (from $GOPATH)
dh_auto_build: go install -v -p 4 git.autistici.org/id/go-sso git.autistici.org/id/go-sso/cmd/saml-server git.autistici.org/id/go-sso/cmd/sso-proxy git.autistici.org/id/go-sso/cmd/sso-server git.autistici.org/id/go-sso/httpsso git.autistici.org/id/go-sso/httputil git.autistici.org/id/go-sso/proxy git.autistici.org/id/go-sso/saml git.autistici.org/id/go-sso/server git.autistici.org/id/go-sso/server/device git.autistici.org/id/go-sso/server/login returned exit code 1
debian/rules:8: recipe for target 'build' failed
make: *** [build] Error 1
dpkg-buildpackage: error: debian/rules build gave error exit status 2
debuild: fatal error at line 1116:
dpkg-buildpackage -rfakeroot -us -uc -b failed
ERROR: debuild failed!
ERROR: Job failed: exit code 1
failed
build_pkg:stretch:amd64 Build Pkg
	/tmp/tmp.vhZ4FbvbMh/build/obj-x86_64-linux-gnu/src/git.autistici.org/id/go-sso/server/httputil (from $GOPATH)
dh_auto_build: go install -v -p 8 git.autistici.org/id/go-sso git.autistici.org/id/go-sso/cmd/saml-server git.autistici.org/id/go-sso/cmd/sso-proxy git.autistici.org/id/go-sso/cmd/sso-server git.autistici.org/id/go-sso/httpsso git.autistici.org/id/go-sso/httputil git.autistici.org/id/go-sso/proxy git.autistici.org/id/go-sso/saml git.autistici.org/id/go-sso/server git.autistici.org/id/go-sso/server/device git.autistici.org/id/go-sso/server/login returned exit code 1
debian/rules:8: recipe for target 'build' failed
make: *** [build] Error 1
dpkg-buildpackage: error: debian/rules build gave error exit status 2
debuild: fatal error at line 1116:
dpkg-buildpackage -rfakeroot -us -uc -b failed
ERROR: debuild failed!
ERROR: Job failed: exit code 1